BDBM41420 MLS000116420::N-propyl-4,5-dihydrobenz[g]indoxazene-3-carboxamide::N-propyl-4,5-dihydrobenzo[g][1,2]benzoxazole-3-carboxamide::SMR000093397::cid_5309634
SMILES CCCNC(=O)c1noc-2c1CCc1ccccc-21
InChI Key InChIKey=PJGPFPBITKSDBX-UHFFFAOYSA-N
Data  1 IC50
  Tab Delimited (TSV)   2D SDfile   Computed 3D by Vconf -m prep SDfile
Find this compound or compounds like it in BindingDB:
Activity Spreadsheet -- Enzyme Inhibition Constant Data from BindingDB
Found 1 hit for monomerid = 41420
TargetCathepsin G(Homo sapiens (Human))
Pcmd
Curated by PubChem BioAssay
LigandPNGBDBM41420(MLS000116420 | N-propyl-4,5-dihydrobenz[g]indoxaze...)
Affinity DataIC50:  2.55E+3nM. Assay description: Screening Center: Penn Center for Molecular Discovery Center Affiliation: University of Pennsylvania Network: Molecular Library Screening Center Netw...
In DepthDetails PCBioAssay