BDBM415283 Preparation of 1-(1-methyl-1H-pyrazol-4-yl)-3-{4-[4-oxo-3-(phenylamino)-4,5,6,7-tetrahydro-1H-indol-2-yl]pyridin-2-yl}urea::US10428044, Example 390
SMILES Cn1cc(NC(=O)Nc2cc(ccn2)-c2[nH]c3CCCC(=O)c3c2Nc2ccccc2)cn1
InChI Key InChIKey=LVFPXVNPHLPCBZ-UHFFFAOYSA-N
Data  1 IC50
  Tab Delimited (TSV)   2D SDfile   Computed 3D by Vconf -m prep SDfile
Find this compound or compounds like it in BindingDB:
Activity Spreadsheet -- Enzyme Inhibition Constant Data from BindingDB
Found 1 hit for monomerid = 415283
TargetMitotic checkpoint serine/threonine-protein kinase BUB1(Homo sapiens (Human))
Bayer Pharma Aktiengesellschaft
US Patent
LigandPNGBDBM415283(Preparation of 1-(1-methyl-1H-pyrazol-4-yl)-3-{4-[...)
Affinity DataIC50:  3.96nM. Assay description: In a typical assay 11 different concentrations of each compound (0.1 nM, 0.33 nM, 1.1 nM, 3.8 nM, 13 nM, 44 nM, 0.15 μM, 0.51 μM, 1.7 μ...
Ligand InfoPC cidPC sid
In DepthDetails US Patent