BDBM416856 1-(3-(aminomethyl)phenyl)-N-(5-((cyclopropylmethylamino)(2-hydroxyphenyl)methyl)-2-fluorophenyl)-3-(trifluoromethyl)-1H-pyrazole-5-carboxamide::US10329260, Compound 60e::US10633345, Compound 66b::US10689346, Compound 60e::US11203574, Compound 66b::US11230530, Compound 66b::US11685721, Compound 60e::US11708332, Compound 66b
SMILES NCc1cccc(c1)-n1nc(cc1C(=O)Nc1cc(ccc1F)C(NCC1CC1)c1ccccc1O)C(F)(F)F
InChI Key InChIKey=CKWWRAGQIQAYTL-UHFFFAOYSA-N
Data  21 KI
  Tab Delimited (TSV)   2D SDfile   Computed 3D by Vconf -m prep SDfile
Find this compound or compounds like it in BindingDB:
Activity Spreadsheet -- Enzyme Inhibition Constant Data from BindingDB
Found 21 hits for monomerid = 416856
TargetPlasma kallikrein(Homo sapiens (Human))
Biocryst Pharmaceuticals
US Patent
LigandPNGBDBM416856(1-(3-(aminomethyl)phenyl)-N-(5-((cyclopropylmethyl...)
Affinity DataKi:  25.1nM. Assay description: The effect of compounds of the invention on human plasma kallikrein activity was determined using the chromogenic substrates (DiaPharma Group, Inc., ...
Ligand InfoPC cidPC sid
In DepthDetails US Patent
TargetPlasma kallikrein(Homo sapiens (Human))
Biocryst Pharmaceuticals
US Patent
LigandPNGBDBM416856(1-(3-(aminomethyl)phenyl)-N-(5-((cyclopropylmethyl...)
Affinity DataKi:  25.1nM. Assay description: Plasma kallikrein activity assay. The effect of compounds of the invention on human plasma kallikrein activity was determined using the chromogenic s...
Ligand InfoPC cidPC sid
In DepthDetails US Patent
TargetPlasma kallikrein(Homo sapiens (Human))
Biocryst Pharmaceuticals
US Patent
LigandPNGBDBM416856(1-(3-(aminomethyl)phenyl)-N-(5-((cyclopropylmethyl...)
Affinity DataKi:  25.1nM. Assay description: The effect of compounds of the invention on human plasma kallikrein activity was determined using the chromogenic substrates (DiaPharma Group, Inc., ...
Ligand InfoPC cidPC sid
In DepthDetails US Patent
TargetPlasma kallikrein(Homo sapiens (Human))
Biocryst Pharmaceuticals
US Patent
LigandPNGBDBM416856(1-(3-(aminomethyl)phenyl)-N-(5-((cyclopropylmethyl...)
Affinity DataKi:  25.1nM. Assay description: The effect of compounds of the invention on human plasma kallikrein activity was determined using the chromogenic substrates. In these experiments, 2...
Ligand InfoPC cidPC sid
In DepthDetails US Patent
TargetPlasma kallikrein(Homo sapiens (Human))
Biocryst Pharmaceuticals
US Patent
LigandPNGBDBM416856(1-(3-(aminomethyl)phenyl)-N-(5-((cyclopropylmethyl...)
Affinity DataKi:  25.1nM. Assay description: The effect of compounds of the invention on human plasma kallikrein activity was determined using the chromogenic substrates. In these experiments, 2...
Ligand InfoPC cidPC sid
In DepthDetails US Patent
TargetPlasma kallikrein(Homo sapiens (Human))
Biocryst Pharmaceuticals
US Patent
LigandPNGBDBM416856(1-(3-(aminomethyl)phenyl)-N-(5-((cyclopropylmethyl...)
Affinity DataKi:  25.1nM. Assay description: The effect of compounds of the invention on human plasma kallikrein activity was determined using the chromogenic substrates. In these experiments, 2...
Ligand InfoPC cidPC sid
In DepthDetails US Patent
TargetPlasma kallikrein(Homo sapiens (Human))
Biocryst Pharmaceuticals
US Patent
LigandPNGBDBM416856(1-(3-(aminomethyl)phenyl)-N-(5-((cyclopropylmethyl...)
Affinity DataKi:  25.1nM. Assay description: The effect of compounds of the invention on human plasma kallikrein activity was determined using the chromogenic substrates (DiaPharma Group, Inc., ...
Ligand InfoPC cidPC sid
In DepthDetails US Patent
TargetPlasma kallikrein(Homo sapiens (Human))
Biocryst Pharmaceuticals
US Patent
LigandPNGBDBM416856(1-(3-(aminomethyl)phenyl)-N-(5-((cyclopropylmethyl...)
Affinity DataKi:  25.1nM. Assay description: The effect of compounds of the invention on human plasma kallikrein activity was determined using the chromogenic substrates (DiaPharma Group, Inc., ...
Ligand InfoPC cidPC sid
In DepthDetails US Patent
TargetPlasma kallikrein(Homo sapiens (Human))
Biocryst Pharmaceuticals
US Patent
LigandPNGBDBM416856(1-(3-(aminomethyl)phenyl)-N-(5-((cyclopropylmethyl...)
Affinity DataKi:  25.1nM. Assay description: The effect of compounds of the invention on human plasma kallikrein activity was determined using the chromogenic substrates (DiaPharma Group, Inc., ...
Ligand InfoPC cidPC sid
In DepthDetails US Patent
TargetPlasma kallikrein(Homo sapiens (Human))
Biocryst Pharmaceuticals
US Patent
LigandPNGBDBM416856(1-(3-(aminomethyl)phenyl)-N-(5-((cyclopropylmethyl...)
Affinity DataKi:  25.1nM. Assay description: Plasma kallikrein activity assay. The effect of compounds of the invention on human plasma kallikrein activity was determined using the chromogenic s...
Ligand InfoPC cidPC sid
In DepthDetails US Patent
TargetPlasma kallikrein(Homo sapiens (Human))
Biocryst Pharmaceuticals
US Patent
LigandPNGBDBM416856(1-(3-(aminomethyl)phenyl)-N-(5-((cyclopropylmethyl...)
Affinity DataKi:  25.1nM. Assay description: The effect of compounds of the invention on human plasma kallikrein activity was determined using the chromogenic substrates (DiaPharma Group, Inc., ...
Ligand InfoPC cidPC sid
In DepthDetails US Patent
TargetPlasma kallikrein(Homo sapiens (Human))
Biocryst Pharmaceuticals
US Patent
LigandPNGBDBM416856(1-(3-(aminomethyl)phenyl)-N-(5-((cyclopropylmethyl...)
Affinity DataKi:  25.1nM. Assay description: Plasma kallikrein activity assay. The effect of compounds of the invention on human plasma kallikrein activity was determined using the chromogenic s...
Ligand InfoPC cidPC sid
In DepthDetails US Patent
TargetPlasma kallikrein(Homo sapiens (Human))
Biocryst Pharmaceuticals
US Patent
LigandPNGBDBM416856(1-(3-(aminomethyl)phenyl)-N-(5-((cyclopropylmethyl...)
Affinity DataKi:  25.1nM. Assay description: Plasma kallikrein activity assay. The effect of compounds of the invention on human plasma kallikrein activity was determined using the chromogenic s...
Ligand InfoPC cidPC sid
In DepthDetails US Patent
TargetPlasma kallikrein(Homo sapiens (Human))
Biocryst Pharmaceuticals
US Patent
LigandPNGBDBM416856(1-(3-(aminomethyl)phenyl)-N-(5-((cyclopropylmethyl...)
Affinity DataKi:  25.1nM. Assay description: The effect of compounds of the invention on human plasma kallikrein activity was determined using the chromogenic substrates (DiaPharma Group, Inc., ...
Ligand InfoPC cidPC sid
In DepthDetails US Patent
TargetPlasma kallikrein(Homo sapiens (Human))
Biocryst Pharmaceuticals
US Patent
LigandPNGBDBM416856(1-(3-(aminomethyl)phenyl)-N-(5-((cyclopropylmethyl...)
Affinity DataKi:  25.1nM. Assay description: The effect of compounds of the invention on human plasma kallikrein activity was determined using the chromogenic substrates (DiaPharma Group, Inc., ...
Ligand InfoPC cidPC sid
In DepthDetails US Patent
TargetPlasma kallikrein(Homo sapiens (Human))
Biocryst Pharmaceuticals
US Patent
LigandPNGBDBM416856(1-(3-(aminomethyl)phenyl)-N-(5-((cyclopropylmethyl...)
Affinity DataKi:  25.1nM. Assay description: Plasma kallikrein activity assay. The effect of compounds of the invention on human plasma kallikrein activity was determined using the chromogenic s...
Ligand InfoPC cidPC sid
In DepthDetails US Patent
TargetPlasma kallikrein(Homo sapiens (Human))
Biocryst Pharmaceuticals
US Patent
LigandPNGBDBM416856(1-(3-(aminomethyl)phenyl)-N-(5-((cyclopropylmethyl...)
Affinity DataKi:  25.1nM. Assay description: Plasma kallikrein activity assay. The effect of compounds of the invention on human plasma kallikrein activity was determined using the chromogenic s...
Ligand InfoPC cidPC sid
In DepthDetails US Patent
TargetPlasma kallikrein(Homo sapiens (Human))
Biocryst Pharmaceuticals
US Patent
LigandPNGBDBM416856(1-(3-(aminomethyl)phenyl)-N-(5-((cyclopropylmethyl...)
Affinity DataKi:  25.1nM. Assay description: The effect of compounds of the invention on human plasma kallikrein activity was determined using the chromogenic substrates (DiaPharma Group, Inc., ...
Ligand InfoPC cidPC sid
In DepthDetails US Patent
TargetPlasma kallikrein(Homo sapiens (Human))
Biocryst Pharmaceuticals
US Patent
LigandPNGBDBM416856(1-(3-(aminomethyl)phenyl)-N-(5-((cyclopropylmethyl...)
Affinity DataKi:  25.1nM. Assay description: The effect of compounds of the invention on human plasma kallikrein activity was determined using the chromogenic substrates (DiaPharma Group, Inc., ...
Ligand InfoPC cidPC sid
In DepthDetails US Patent
TargetPlasma kallikrein(Homo sapiens (Human))
Biocryst Pharmaceuticals
US Patent
LigandPNGBDBM416856(1-(3-(aminomethyl)phenyl)-N-(5-((cyclopropylmethyl...)
Affinity DataKi:  25.1nM. Assay description: The effect of compounds of the invention on human plasma kallikrein activity was determined using the chromogenic substrates (DiaPharma Group, Inc., ...
Ligand InfoPC cidPC sid
In DepthDetails US Patent
TargetPlasma kallikrein(Homo sapiens (Human))
Biocryst Pharmaceuticals
US Patent
LigandPNGBDBM416856(1-(3-(aminomethyl)phenyl)-N-(5-((cyclopropylmethyl...)
Affinity DataKi:  25.1nM. Assay description: The effect of compounds of the invention on human plasma kallikrein activity was determined using the chromogenic substrates (DiaPharma Group, Inc., ...
Ligand InfoPC cidPC sid
In DepthDetails US Patent