BDBM41837 2-furanyl-[4-(9-methyl-5H-pyrimido[5,4-b]indol-4-yl)-1-piperazinyl]methanone::2-furyl-[4-(9-methyl-5H-pyrimid[5,4-b]indol-4-yl)piperazino]methanone::Furan-2-yl-[4-(9-methyl-5H-pyrimido[5,4-b]indol-4-yl)-piperazin-1-yl]-methanone::MLS000558194::SMR000148910::cid_1979644::furan-2-yl-[4-(9-methyl-5H-pyrimido[5,4-b]indol-4-yl)piperazin-1-yl]methanone
SMILES Cc1cccc2[nH]c3c(ncnc3c12)N1CCN(CC1)C(=O)c1ccco1
InChI Key InChIKey=IRQKMWLRGOXGDP-UHFFFAOYSA-N
Data  1 IC50  2 EC50
  Tab Delimited (TSV)   2D SDfile   Computed 3D by Vconf -m prep SDfile
Find this compound or compounds like it in BindingDB:
Activity Spreadsheet -- Enzyme Inhibition Constant Data from BindingDB
Found 3 hits for monomerid = 41837
TargetSerine/threonine-protein kinase PLK1(Homo sapiens (Human))
University of Pittsburgh
Curated by PubChem BioAssay
LigandPNGBDBM41837(2-furanyl-[4-(9-methyl-5H-pyrimido[5,4-b]indol-4-y...)
Affinity DataEC50: >5.00E+4nM. Assay description: List of compounds to be tested: Compounds that met the active criterion of Z-score is
In DepthDetails PCBioAssay
TargetSerine/threonine-protein kinase PLK1(Homo sapiens (Human))
University of Pittsburgh
Curated by PubChem BioAssay
LigandPNGBDBM41837(2-furanyl-[4-(9-methyl-5H-pyrimido[5,4-b]indol-4-y...)
Affinity DataEC50: >5.00E+4nM. Assay description: List of compounds to be tested: Compounds that met the active criterion of Z-score is
In DepthDetails PCBioAssay
TargetSerine/threonine-protein kinase PLK1(Homo sapiens (Human))
University of Pittsburgh
Curated by PubChem BioAssay
LigandPNGBDBM41837(2-furanyl-[4-(9-methyl-5H-pyrimido[5,4-b]indol-4-y...)
Affinity DataIC50: >5.00E+4nM. Assay description: List of compounds to be tested: Compounds that met the active criterion of Z-score is
In DepthDetails PCBioAssay