BDBM41880 2-methoxy-5-methyl-N-(2-naphthalenyl)benzenesulfonamide::2-methoxy-5-methyl-N-(2-naphthyl)benzenesulfonamide::2-methoxy-5-methyl-N-naphthalen-2-yl-benzenesulfonamide::2-methoxy-5-methyl-N-naphthalen-2-ylbenzenesulfonamide::MLS-0202040.0001::cid_8512577
SMILES COc1ccc(C)cc1S(=O)(=O)Nc1ccc2ccccc2c1
InChI Key InChIKey=KGXQNYGCZHMCOZ-UHFFFAOYSA-N
Data  2 IC50
  Tab Delimited (TSV)   2D SDfile   Computed 3D by Vconf -m prep SDfile
Find this compound or compounds like it in BindingDB:
Activity Spreadsheet -- Enzyme Inhibition Constant Data from BindingDB
Found 2 hits for monomerid = 41880
TargetAlkaline phosphatase, tissue-nonspecific isozyme(Homo sapiens (Human))
Burnham Center For Chemical Genomics
Curated by PubChem BioAssay
LigandPNGBDBM41880(2-methoxy-5-methyl-N-(2-naphthalenyl)benzenesulfon...)
Affinity DataIC50: >1.00E+5nM. Assay description: Sanford-Burnham Center for Chemical Genomics (SBCCG) Sanford-Burnham Medical Research Institute (SBMRI, San Diego, CA) NIH Molecular Libraries Screen...
In DepthDetails PCBioAssay
TargetAlkaline phosphatase, germ cell type(Homo sapiens (Human))
Sanford-Burnham Center For Chemical Genomics
Curated by PubChem BioAssay
LigandPNGBDBM41880(2-methoxy-5-methyl-N-(2-naphthalenyl)benzenesulfon...)
Affinity DataIC50: >1.00E+5nM. Assay description: Data Source: Sanford-Burnham Center for Chemical Genomics (SBCCG) Source Affiliation: Sanford-Burnham Medical Research Institute (SBMRI, San Diego, C...
In DepthDetails PCBioAssay