BDBM418840 2-methyl-4-{[4-({3- [methyl(methylsulfonyl)amino]benzyl} amino)-5-(trifluoromethyl)pyrimidin-2- yl]amino}benzamide (340)::US10450297, Example 340
SMILES CN(c1cccc(CNc2nc(Nc3ccc(C(N)=O)c(C)c3)ncc2C(F)(F)F)c1)S(C)(=O)=O
InChI Key InChIKey=BUPYMOVHDGDZMH-UHFFFAOYSA-N
Data  1 IC50
  Tab Delimited (TSV)   2D SDfile   Computed 3D by Vconf -m prep SDfile
Find this compound or compounds like it in BindingDB:
Activity Spreadsheet -- Enzyme Inhibition Constant Data from BindingDB
Found 1 hit for monomerid = 418840
TargetFocal adhesion kinase 1 [410-689](Homo sapiens (Human))
Pfizer
US Patent
LigandPNGBDBM418840(2-methyl-4-{[4-({3- [methyl(methylsulfonyl)amino]b...)
Affinity DataIC50: <0.595nM. Assay description: The in vitro activity of the compounds of the compounds of the invention may be determined by the following procedure. More particularly, the followi...
Ligand InfoPC cidPC sid
In DepthDetails US Patent