BDBM419279 1-{5-tert-Butyl-3-[(2-chlorophenyl)methyl]-3H-[1,2,3]triazolo[4,5-d]pyrimidin-7-yl}pyrrolidine-3-thiol::US10457685, Example 8
SMILES CC(C)(C)c1nc(N2CCC(S)C2)c2nnn(Cc3ccccc3Cl)c2n1
InChI Key InChIKey=SURAYFKZYQAPAQ-UHFFFAOYSA-N
Data  2 KI
  Tab Delimited (TSV)   2D SDfile   Computed 3D by Vconf -m prep SDfile
Find this compound or compounds like it in BindingDB:
Activity Spreadsheet -- Enzyme Inhibition Constant Data from BindingDB
Found 2 hits for monomerid = 419279
TargetCannabinoid receptor 2(Homo sapiens (Human))
Hoffmann-La Roche
US Patent
LigandPNGBDBM419279(1-{5-tert-Butyl-3-[(2-chlorophenyl)methyl]-3H-[1,2...)
Affinity DataKi:  85nM. Assay description: he affinity of the compounds of the invention for cannabinoid receptors was determined using recommended amounts of membrane preparations (PerkinElme...
Ligand InfoPC cidPC sid
In DepthDetails US Patent
TargetCannabinoid receptor 1(Homo sapiens (Human))
Hoffmann-La Roche
US Patent
LigandPNGBDBM419279(1-{5-tert-Butyl-3-[(2-chlorophenyl)methyl]-3H-[1,2...)
Affinity DataKi:  1.47E+3nM. Assay description: he affinity of the compounds of the invention for cannabinoid receptors was determined using recommended amounts of membrane preparations (PerkinElme...
Ligand InfoPC cidPC sid
In DepthDetails US Patent