BDBM419319 US10457703, Example 1
SMILES CC[C@H]1[C@@H](O)[C@H]2[C@@H]3CC[C@H]([C@H](C)CCCOC(=O)NS(=O)(=O)c4ccc(C)cc4)[C@@]3(C)CC[C@@H]2[C@@]2(C)CC[C@@H](O)C[C@@H]12
InChI Key InChIKey=RCTZSZGAPQAIAF-NAVXLWHOSA-N
Data  1 EC50
  Tab Delimited (TSV)   2D SDfile   Computed 3D by Vconf -m prep SDfile
Find this compound or compounds like it in BindingDB:
Activity Spreadsheet -- Enzyme Inhibition Constant Data from BindingDB
Found 1 hit for monomerid = 419319
TargetBile acid receptor(Homo sapiens (Human))
Enanta Pharmaceuticals
US Patent
LigandPNGBDBM419319(US10457703, Example 1)
Affinity DataEC50:  55nM. Assay description: Determination of a ligand mediated Gal4 promoter driven transactivation to quantify ligand binding mediated activation of FXR. FXR Reporter Assay kit...
Ligand InfoPC cidPC sid
In DepthDetails US Patent