BDBM420064 US10464947, Example 176::US11498926, Example 176::{1-[(4S)-7-(3,5-dimethylisoxazol-4-yl)- 4-pyridin-2-yl-4,5-dihydroimidazo[1,5,4- de][1,4]benzoxazin-2-yl]piperidin-4- yl}methanol
SMILES Cc1noc(C)c1-c1ccc2nc(N3CCC(CO)CC3)n3[C@H](COc1c23)c1ccccn1
InChI Key InChIKey=NBZHMCJXKXYYJS-OAQYLSRUSA-N
Data  4 IC50
  Tab Delimited (TSV)   2D SDfile   Computed 3D by Vconf -m prep SDfile
Find this compound or compounds like it in BindingDB:
Activity Spreadsheet -- Enzyme Inhibition Constant Data from BindingDB
Found 4 hits for monomerid = 420064
TargetBromodomain-containing protein 4 [42-168](Homo sapiens (Human))
Incyte Holdings
US Patent
LigandPNGBDBM420064(US10464947, Example 176 | US11498926, Example 176 ...)
Affinity DataIC50: <100nM. Assay description: BRD4-BD1 and BRD4-BD2 assays were conducted in white 384-well polystyrene plate in a final volume of 40 μL for BD1 and 60 μL for BD2. Inhib...
Ligand InfoPC cidPC sid
In DepthDetails US Patent
TargetBromodomain-containing protein 4 [353-454](Homo sapiens (Human))
Incyte
US Patent
LigandPNGBDBM420064(US10464947, Example 176 | US11498926, Example 176 ...)
Affinity DataIC50: <100nM. Assay description: Table 12: BRD4-BD1 and BRD4-BD2 assays were conducted in white 384-well polystyrene plate in a final volume of 40 μL for BD1 and 60 μL for ...
Ligand InfoPC cidPC sid
In DepthDetails US Patent
TargetBromodomain-containing protein 4 [58-164](Homo sapiens (Human))
Incyte
US Patent
LigandPNGBDBM420064(US10464947, Example 176 | US11498926, Example 176 ...)
Affinity DataIC50: <100nM. Assay description: Table 11: BRD4-BD1 and BRD4-BD2 assays were conducted in white 384-well polystyrene plate in a final volume of 20 μL for BD1 and 40 μL for ...
Ligand InfoPC cidPC sid
In DepthDetails US Patent
TargetBromodomain-containing protein 4 [342-460](Homo sapiens (Human))
Incyte Holdings
US Patent
LigandPNGBDBM420064(US10464947, Example 176 | US11498926, Example 176 ...)
Affinity DataIC50: <100nM. Assay description: BRD4-BD1 and BRD4-BD2 assays were conducted in white 384-well polystyrene plate in a final volume of 40 μL for BD1 and 60 μL for BD2. Inhib...
Ligand InfoPC cidPC sid
In DepthDetails US Patent