BDBM420415 US10479798, Compound 12
SMILES COc1cc2ccc3OC([C@@H](N)Cc3c2cc1OC)c1cc(F)c(F)cc1F
InChI Key InChIKey=NXPAPTOHRVIGJL-PBVYKCSPSA-N
Data  1 IC50
  Tab Delimited (TSV)   2D SDfile   Computed 3D by Vconf -m prep SDfile
Find this compound or compounds like it in BindingDB:
Activity Spreadsheet -- Enzyme Inhibition Constant Data from BindingDB
Found 1 hit for monomerid = 420415
TargetDipeptidyl peptidase 4(Homo sapiens (Human))
East China University of Science and Technology
US Patent
LigandPNGBDBM420415(US10479798, Compound 12)
Affinity DataIC50:  4nM. Assay description: Screening Method:Name of method: Activity Evaluation of DPP4, Fluorescence.Instrument: Microplate reader, Envision (PerkinElmer, USA).Material: human...
Ligand Info
In DepthDetails US Patent