BDBM430891 US10550102, Example 17b
SMILES CCOC(=O)c1cnn(c1CC)-c1cccc(n1)-c1cccc2c(C)c[nH]c12
InChI Key InChIKey=RWUWPTOBELWEKL-UHFFFAOYSA-N
Data  1 EC50
  Tab Delimited (TSV)   2D SDfile   Computed 3D by Vconf -m prep SDfile
Find this compound or compounds like it in BindingDB:
Activity Spreadsheet -- Enzyme Inhibition Constant Data from BindingDB
Found 1 hit for monomerid = 430891
TargetGuanylate cyclase soluble subunit alpha-1/beta-1(Homo sapiens (Human))
Novartis
US Patent
LigandPNGBDBM430891(US10550102, Example 17b)
Affinity DataEC50:  0.5nM. Assay description: Chinese hamster ovary (CHO) cells overexpressing soluble guanylate cyclase were generated to test the effect of sGC activators in a cellular context....
Ligand InfoPC cidPC sid
In DepthDetails US Patent