BDBM434902 4'-(1-(2-benzylpiperidine-1- carbonyl)-1H-1,2,3-triazol-4-yl)- N,N-dimethyl-[1,1'-biphenyl]-3- carboxamide::US10583137, Compound 76
SMILES CN(C)C(=O)c1cccc(c1)-c1ccc(cc1)-c1cn(nn1)C(=O)N1CCCCC1Cc1ccccc1
InChI Key InChIKey=COLAHIUBKSQAPY-UHFFFAOYSA-N
Data  2 IC50
  Tab Delimited (TSV)   2D SDfile   Computed 3D by Vconf -m prep SDfile
Find this compound or compounds like it in BindingDB:
Activity Spreadsheet -- Enzyme Inhibition Constant Data from BindingDB
Found 2 hits for monomerid = 434902
TargetDiacylglycerol lipase-beta(Homo sapiens (Human))
The Scripps Research Institute
US Patent
LigandPNGBDBM434902(4'-(1-(2-benzylpiperidine-1- carbonyl)-1H-1,2,3-tr...)
Affinity DataIC50: >1.00E+4nM. Assay description: Briefly, membrane proteome (1 mg/ml, 20 μL) was prepared from HEK293T cells (transiently transfected with hDAGLα-FLAG or hDAGLα-S472A-...
Ligand InfoPC cidPC sid
In DepthDetails US Patent
TargetDiacylglycerol lipase-alpha(Homo sapiens (Human))
The Scripps Research Institute
US Patent
LigandPNGBDBM434902(4'-(1-(2-benzylpiperidine-1- carbonyl)-1H-1,2,3-tr...)
Affinity DataIC50:  1.20E+3nM. Assay description: Briefly, membrane proteome (1 mg/ml, 20 μL) was prepared from HEK293T cells (transiently transfected with hDAGLα-FLAG or hDAGLα-S472A-...
Ligand InfoPC cidPC sid
In DepthDetails US Patent