BDBM435023 US10584114, Compound 150::US11279688, Compound 150
SMILES CO[C@@]1(CC[C@@H](CC1)c1nc(C)cc(Nc2cc(C)[nH]n2)n1)C(=O)NCc1cnc(cn1)-n1cc(F)cn1
InChI Key
Data  4 IC50
  Tab Delimited (TSV)   2D SDfile   Computed 3D by Vconf -m prep SDfile
Find this compound or compounds like it in BindingDB:
Activity Spreadsheet -- Enzyme Inhibition Constant Data from BindingDB
Found 4 hits for monomerid = 435023
TargetProto-oncogene tyrosine-protein kinase receptor Ret(Homo sapiens (Human))
Blueprint Medicines
US Patent
LigandPNGBDBM435023(US10584114, Compound 150 | US11279688, Compound 15...)
Affinity DataIC50: <500nM. Assay description: In each well of a 384-well plate, 7.5 nM-10 nM of wild type RET (ProQinase 1090-0000-1) was incubated in a total of 12.5 μL of buffer (100 mM HE...
Ligand InfoPC cidPC sid
In DepthDetails US Patent
TargetProto-oncogene tyrosine-protein kinase receptor Ret [V804L](Homo sapiens (Human))
Blueprint Medicines
US Patent
LigandPNGBDBM435023(US10584114, Compound 150 | US11279688, Compound 15...)
Affinity DataIC50: <10nM. Assay description: In each well of a 384-well plate, 7.5 nM-10 nM of mutant RET (ProQinase 1096-0000-1) was incubated in a total of 12.5 μL of buffer (100 mM HEPES...
Ligand InfoPC cidPC sid
In DepthDetails US Patent
TargetProto-oncogene tyrosine-protein kinase receptor Ret(Homo sapiens (Human))
Blueprint Medicines
US Patent
LigandPNGBDBM435023(US10584114, Compound 150 | US11279688, Compound 15...)
Affinity DataIC50: <10nM. Assay description: In each well of a 384-well plate, 7.5 nM-10 nM of wild type RET (ProQinase 1090-0000-1) was incubated in a total of 12.5 μL of buffer (100 mM HE...
Ligand InfoPC cidPC sid
In DepthDetails US Patent
TargetProto-oncogene tyrosine-protein kinase receptor Ret [V804L](Homo sapiens (Human))
Blueprint Medicines
US Patent
LigandPNGBDBM435023(US10584114, Compound 150 | US11279688, Compound 15...)
Affinity DataIC50: <500nM. Assay description: In each well of a 384-well plate, 7.5 nM-10 nM of mutant RET (ProQinase 1096-0000-1) was incubated in a total of 12.5 μL of buffer (100 mM HEPES...
Ligand InfoPC cidPC sid
In DepthDetails US Patent