BDBM435059 (2S)-1-(5-fluorobenzofuran-2-yl)sulfonyl-N- [[1-(4-fluorophenyl-3-isopropyl-2,4-dioxo- pyrimidin-5-yl]methyl]pyrrolidine-2- carboxamide::US10584116, Example 39
SMILES CC(C)n1c(=O)c(CNC(=O)[C@@H]2CCCN2S(=O)(=O)c2cc3cc(F)ccc3o2)cn(-c2ccc(F)cc2)c1=O
InChI Key InChIKey=PFFILXROCXLMKU-QFIPXVFZSA-N
Data  1 IC50
  Tab Delimited (TSV)   2D SDfile   Computed 3D by Vconf -m prep SDfile
Find this compound or compounds like it in BindingDB:
Activity Spreadsheet -- Enzyme Inhibition Constant Data from BindingDB
Found 1 hit for monomerid = 435059
TargetTransient receptor potential cation channel subfamily A member 1(Homo sapiens (Human))
Ea Pharma
US Patent
LigandPNGBDBM435059((2S)-1-(5-fluorobenzofuran-2-yl)sulfonyl-N- [[1-(4...)
Affinity DataIC50:  100nM. Assay description: Human TRPA1 Expression PlasmidUsing cDNA encoding human TRPA1 (GenBank accession No. NM_007332) (manufactured by Kazusa DNA Research Institute, item ...
Ligand InfoPC cidPC sid
In DepthDetails US Patent