BDBM435377 US10568876, Example 136::methyl 3-(2-(2-ethoxyacetyl)-8-((2- phenylcyclopropanecarboxamido)methyl)- 1,2,3,4-tetrahydroisoquinolin-5- yl)benzoate (mixture of 4 isomers)
SMILES CCOCC(=O)N1CCc2c(C1)c(CNC(=O)C1CC1c1ccccc1)ccc2-c1cccc(c1)C(=O)OC
InChI Key InChIKey=SZKCHHRPAXDFOK-UHFFFAOYSA-N
Data  1 IC50
  Tab Delimited (TSV)   2D SDfile   Computed 3D by Vconf -m prep SDfile
Find this compound or compounds like it in BindingDB:
Activity Spreadsheet -- Enzyme Inhibition Constant Data from BindingDB
Found 1 hit for monomerid = 435377
TargetDiacylglycerol O-acyltransferase 2(Homo sapiens (Human))
Merck Sharp & Dohme
US Patent
LigandPNGBDBM435377(US10568876, Example 136 | methyl 3-(2-(2-ethoxyace...)
Affinity DataIC50:  2.17E+3nM. Assay description: DGAT2 activity was determined by measuring the amount of enzymatic product triolein (1,2,3-Tri(cis-9-octadecenoyl)glycerol) using the membrane prep m...
Ligand InfoPC cidPC sid
In DepthDetails US Patent