BDBM443389 US10654856, Compound 14
SMILES CCCOc1nc(N)c2[nH]cc(Cc3ccc(CN4CC(C)OC(C)C4)cc3)c2n1
InChI Key
Data  1 EC50
  Tab Delimited (TSV)   2D SDfile   Computed 3D by Vconf -m prep SDfile
Find this compound or compounds like it in BindingDB:
Activity Spreadsheet -- Enzyme Inhibition Constant Data from BindingDB
Found 1 hit for monomerid = 443389
TargetToll-like receptor 7(Homo sapiens (Human))
Chia Tai Tianqing Pharmaceutical Group
US Patent
LigandPNGBDBM443389(US10654856, Compound 14)
Affinity DataEC50:  550nM. Assay description: The compounds were gradient diluted with DMSO in 3-fold using liquid work station POD starting at a concentration of 10 mmol/L and 10 points were dil...
Ligand InfoPC cidPC sid
In DepthDetails US Patent