BDBM445286 US10669239, Compound 21
SMILES Cc1cc(NC(=O)N[C@H]2[C@H](O)CC(C)(C)c3ccccc23)c(nc1-c1cnc(nc1)C(C)(C)O)-c1ccccc1
InChI Key InChIKey=XEHQTMLJJIQJJA-LEAFIULHSA-N
Data  1 IC50
  Tab Delimited (TSV)   2D SDfile   Computed 3D by Vconf -m prep SDfile
Find this compound or compounds like it in BindingDB:
Activity Spreadsheet -- Enzyme Inhibition Constant Data from BindingDB
Found 1 hit for monomerid = 445286
TargetHigh affinity nerve growth factor receptor(Homo sapiens (Human))
Mochida Pharmaceutical
US Patent
LigandPNGBDBM445286(US10669239, Compound 21)
Affinity DataIC50: <50nM. Assay description: Measurement was carried out using TrkA LanthaScreen (registered trademark) Eu Kinase Binding Assay (ThermoFisher SCIENTIFIC). To a 384 well plate (Co...
Ligand InfoPC cidPC sid
In DepthDetails US Patent