BDBM445411 US10683279, Example 8a::US10988458, Example 8a::US11560368, Example 8a
SMILES Cc1cc(F)c(cc1-n1cnc(c1)C1CC1)C(=O)Nc1cccc(n1)-c1nnnn1C1CCCC1
InChI Key InChIKey=KUIJWACEZAUGLM-UHFFFAOYSA-N
Data  3 IC50
  Tab Delimited (TSV)   2D SDfile   Computed 3D by Vconf -m prep SDfile
Find this compound or compounds like it in BindingDB:
Activity Spreadsheet -- Enzyme Inhibition Constant Data from BindingDB
Found 3 hits for monomerid = 445411
TargetMitogen-activated protein kinase kinase kinase 5(Homo sapiens (Human))
Enanta Pharmaceuticals
US Patent
LigandPNGBDBM445411(US10683279, Example 8a | US10988458, Example 8a | ...)
Affinity DataIC50:  5.5nM. Assay description: ASK1 was purchased from Thermofisher, ATP was purchased from Sigma , HTRF® KinEASE™ Assay System was obtained from Cisbio (Bedford, Mass). ½ Area pla...
Ligand InfoPC cidPC sid
In DepthDetails US Patent
TargetMitogen-activated protein kinase kinase kinase 5(Homo sapiens (Human))
Enanta Pharmaceuticals
US Patent
LigandPNGBDBM445411(US10683279, Example 8a | US10988458, Example 8a | ...)
Affinity DataIC50:  5.5nM. Assay description: ASK1 was purchased from Thermofisher (Catalogue # PV4011), ATP was purchased from Sigma (Catalogue # A7699), HTRF® KinEASE™ Assay System was obtained...
Ligand InfoPC cidPC sid
In DepthDetails US Patent
TargetMitogen-activated protein kinase kinase kinase 5(Homo sapiens (Human))
Enanta Pharmaceuticals
US Patent
LigandPNGBDBM445411(US10683279, Example 8a | US10988458, Example 8a | ...)
Affinity DataIC50:  5.5nM. Assay description: ASK1 was purchased from Thermofisher (Catalogue #PV4011), ATP was purchased from Sigma (Catalogue #A7699), HTRF® KinEASE™ Assay System was obtained f...
Ligand InfoPC cidPC sid
In DepthDetails US Patent