BDBM445550 US10683290, Example 48
SMILES CCCC[C@@H](c1ccccn1)n1c2cc(-c3c(C)nnn3C)c(F)cc2c2ncc(cc12)C(C)(C)O
InChI Key InChIKey=UIPQXDHNSMFLFF-QHCPKHFHSA-N
Data  1 IC50
  Tab Delimited (TSV)   2D SDfile   Computed 3D by Vconf -m prep SDfile
Find this compound or compounds like it in BindingDB:
Activity Spreadsheet -- Enzyme Inhibition Constant Data from BindingDB
Found 1 hit for monomerid = 445550
TargetBromodomain-containing protein 4 [1-477](Homo sapiens (Human))
Bristol-Myers Squibb
US Patent
LigandPNGBDBM445550(US10683290, Example 48)
Affinity DataIC50: <1.50E+3nM. Assay description: All assay components were dissolved in buffer composition 20 mM Hepes pH 7.5, 150 mM NaCl, 5 mM DTT, 0.005% Tween 20, and 100 ug/ml BSA for BRD4 (1-4...
Ligand InfoPC cidPC sid
In DepthDetails US Patent