BDBM448646 1-(7-(7-(difluoromethyl)-6-(1-methyl-1H-pyrazol-4-yl)-3,4-dihydroquinolin-1(2H)-yl)-2,3-dihydrobenzo[f][1,4]oxazepin-4(5H)-yl)ethanone::US10696655, Example 112::US11168070, Example 112
SMILES CC(=O)N1CCOc2ccc(cc2C1)N1CCCc2cc(-c3cnn(C)c3)c(cc12)C(F)F
InChI Key InChIKey=CCVDEXYJRQOFEX-UHFFFAOYSA-N
Data  2 IC50
  Tab Delimited (TSV)   2D SDfile   Computed 3D by Vconf -m prep SDfile
Find this compound or compounds like it in BindingDB:
Activity Spreadsheet -- Enzyme Inhibition Constant Data from BindingDB
Found 2 hits for monomerid = 448646
TargetCREB-binding protein(Homo sapiens (Human))
Genentech
US Patent
LigandPNGBDBM448646(1-(7-(7-(difluoromethyl)-6-(1-methyl-1H-pyrazol-4-...)
Affinity DataIC50:  32nM. Assay description: His/Flag epitope tagged CBP was cloned, expressed, and purified to homogeneity. CBP binding and inhibition was assessed by monitoring the engagement ...
Ligand InfoPC cidPC sid
In DepthDetails US Patent
TargetCREB-binding protein(Homo sapiens (Human))
Genentech
US Patent
LigandPNGBDBM448646(1-(7-(7-(difluoromethyl)-6-(1-methyl-1H-pyrazol-4-...)
Affinity DataIC50:  32nM. Assay description: His/Flag epitope tagged CBP was cloned, expressed, and purified to homogeneity. CBP binding and inhibition was assessed by monitoring the engagement ...
Ligand InfoPC cidPC sid
In DepthDetails US Patent