BDBM450499 9H-Fluoren-9- ylmethyl 4-[3-[2- [(3,4- dichlorophenyl) methyl- methylamino]-2- oxoethyl]-4- oxoquinazolin-6- yl]piperazine-1- carboxylate (intermediate A-6) and cyclobutylmethane::US10676446, Example 92
SMILES CN(Cc1ccc(Cl)c(Cl)c1)C(=O)Cn1cnc2ccc(cc2c1=O)N1CCN(CC1)S(=O)(=O)CC1CCC1
InChI Key InChIKey=QIPOIMZYENQYOQ-UHFFFAOYSA-N
Data  1 IC50
  Tab Delimited (TSV)   2D SDfile   Computed 3D by Vconf -m prep SDfile
Find this compound or compounds like it in BindingDB:
Activity Spreadsheet -- Enzyme Inhibition Constant Data from BindingDB
Found 1 hit for monomerid = 450499
TargetEctonucleotide pyrophosphatase/phosphodiesterase family member 2(Homo sapiens (Human))
Hoffmann-La Roche
US Patent
LigandPNGBDBM450499(9H-Fluoren-9- ylmethyl 4-[3-[2- [(3,4- dichlorophe...)
Affinity DataIC50:  7nM. Assay description: ATX inhibition was measured by a fluorescence quenching assay using a specifically labeled substrate analogue (MR121 substrate). To obtain this MR121...
Ligand InfoPC cidPC sid
In DepthDetails US Patent