BDBM450734 US10676467, Compound 8h
SMILES OCC(O)COCc1ccc(cc1)-c1noc(n1)-c1ccc(OCCF)c(c1)C(F)(F)F
InChI Key InChIKey=SFTBJSKKPOKEFN-UHFFFAOYSA-N
Data  6 IC50
  Tab Delimited (TSV)   2D SDfile   Computed 3D by Vconf -m prep SDfile
Find this compound or compounds like it in BindingDB:
Activity Spreadsheet -- Enzyme Inhibition Constant Data from BindingDB
Found 6 hits for monomerid = 450734
TargetSphingosine 1-phosphate receptor 1(Homo sapiens (Human))
Washington University
US Patent
LigandPNGBDBM450734(US10676467, Compound 8h)
Affinity DataIC50:  3.90nM. Assay description: Newly synthesized compounds were first evaluated for binding potency toward S1P1 by a [32P]S1P competitive binding assay following published procedur...
Ligand InfoPC cidPC sid
In DepthDetails US Patent
TargetSphingosine 1-phosphate receptor 1(Homo sapiens (Human))
Washington University
US Patent
LigandPNGBDBM450734(US10676467, Compound 8h)
Affinity DataIC50:  3.90nM. Assay description: Newly synthesized compounds were first evaluated for binding potency toward S1P1 by a [32P]S1P competitive binding assay following published procedur...
Ligand InfoPC cidPC sid
In DepthDetails US Patent
TargetSphingosine 1-phosphate receptor 5(Homo sapiens (Human))
Washington University
US Patent
LigandPNGBDBM450734(US10676467, Compound 8h)
Affinity DataIC50: >1.00E+3nM. Assay description: Newly synthesized compounds were first evaluated for binding potency toward S1P1 by a [32P]S1P competitive binding assay following published procedur...
Ligand InfoPC cidPC sid
In DepthDetails US Patent
TargetSphingosine 1-phosphate receptor 3(Homo sapiens (Human))
Washington University
US Patent
LigandPNGBDBM450734(US10676467, Compound 8h)
Affinity DataIC50: >1.00E+3nM. Assay description: Newly synthesized compounds were first evaluated for binding potency toward S1P1 by a [32P]S1P competitive binding assay following published procedur...
Ligand InfoPC cidPC sid
In DepthDetails US Patent
TargetSphingosine 1-phosphate receptor 4(Homo sapiens (Human))
Washington University
US Patent
LigandPNGBDBM450734(US10676467, Compound 8h)
Affinity DataIC50: >1.00E+3nM. Assay description: Newly synthesized compounds were first evaluated for binding potency toward S1P1 by a [32P]S1P competitive binding assay following published procedur...
Ligand InfoPC cidPC sid
In DepthDetails US Patent
TargetSphingosine 1-phosphate receptor 2(Homo sapiens (Human))
Washington University
US Patent
LigandPNGBDBM450734(US10676467, Compound 8h)
Affinity DataIC50: >1.00E+3nM. Assay description: Newly synthesized compounds were first evaluated for binding potency toward S1P1 by a [32P]S1P competitive binding assay following published procedur...
Ligand InfoPC cidPC sid
In DepthDetails US Patent