BDBM46682 (4-chlorodithiazol-5-ylidene)-(4-nitro-1-naphthyl)amine::4-chloranyl-N-(4-nitronaphthalen-1-yl)-1,2,3-dithiazol-5-imine::4-chloro-N-(4-nitro-1-naphthalenyl)-5-dithiazolimine::4-chloro-N-(4-nitronaphthalen-1-yl)dithiazol-5-imine::MLS-0390827.0001::cid_3311395
SMILES [O-][N+](=O)c1ccc(\N=c2\ssnc2Cl)c2ccccc12
InChI Key InChIKey=FZQITWFDVUPISP-WYMLVPIESA-N
Data  2 IC50
  Tab Delimited (TSV)   2D SDfile   Computed 3D by Vconf -m prep SDfile
Find this compound or compounds like it in BindingDB:
Activity Spreadsheet -- Enzyme Inhibition Constant Data from BindingDB
Found 2 hits for monomerid = 46682
TargetMannose-6-phosphate isomerase(Homo sapiens (Human))
Burnham Center For Chemical Genomics
Curated by PubChem BioAssay
LigandPNGBDBM46682((4-chlorodithiazol-5-ylidene)-(4-nitro-1-naphthyl)...)
Affinity DataIC50: >1.00E+5nM. Assay description: Data Source: Sanford-Burnham Center for Chemical Genomics (SBCCG) Source Affiliation: Sanford-Burnham Medical Research Institute (SBMRI, San Diego, C...
In DepthDetails PCBioAssay
TargetPhosphomannomutase 2(Homo sapiens (Human))
Burnham Center For Chemical Genomics
Curated by PubChem BioAssay
LigandPNGBDBM46682((4-chlorodithiazol-5-ylidene)-(4-nitro-1-naphthyl)...)
Affinity DataIC50: >1.00E+5nM. Assay description: Data Source: Sanford-Burnham Center for Chemical Genomics (SBCCG) Source Affiliation: Sanford-Burnham Medical Research Institute (SBMRI, San Diego, C...
In DepthDetails PCBioAssay