BDBM46700 (4-tert-butylphenyl)-(4-chlorodithiazol-5-ylidene)amine::MLS-0390888.0001::N-(4-tert-butylphenyl)-4-chloranyl-1,2,3-dithiazol-5-imine::N-(4-tert-butylphenyl)-4-chloro-5-dithiazolimine::N-(4-tert-butylphenyl)-4-chlorodithiazol-5-imine::cid_25181211
SMILES CC(C)(C)c1ccc(cc1)\N=c1/ssnc1Cl
InChI Key InChIKey=MZPVRLPDXHITSV-KAMYIIQDSA-N
Data  2 IC50
  Tab Delimited (TSV)   2D SDfile   Computed 3D by Vconf -m prep SDfile
Find this compound or compounds like it in BindingDB:
Activity Spreadsheet -- Enzyme Inhibition Constant Data from BindingDB
Found 2 hits for monomerid = 46700
TargetMannose-6-phosphate isomerase(Homo sapiens (Human))
Burnham Center For Chemical Genomics
Curated by PubChem BioAssay
LigandPNGBDBM46700((4-tert-butylphenyl)-(4-chlorodithiazol-5-ylidene)...)
Affinity DataIC50:  2.36E+4nM. Assay description: Data Source: Sanford-Burnham Center for Chemical Genomics (SBCCG) Source Affiliation: Sanford-Burnham Medical Research Institute (SBMRI, San Diego, C...
In DepthDetails PCBioAssay
TargetPhosphomannomutase 2(Homo sapiens (Human))
Burnham Center For Chemical Genomics
Curated by PubChem BioAssay
LigandPNGBDBM46700((4-tert-butylphenyl)-(4-chlorodithiazol-5-ylidene)...)
Affinity DataIC50: >1.00E+5nM. Assay description: Data Source: Sanford-Burnham Center for Chemical Genomics (SBCCG) Source Affiliation: Sanford-Burnham Medical Research Institute (SBMRI, San Diego, C...
In DepthDetails PCBioAssay