BDBM47860 2-(4-acetamido-N-[2-(1-benzotriazolyl)-1-oxoethyl]anilino)-N-cyclopentyl-2-(3,4-dihydroxyphenyl)acetamide::2-(4-acetamido-N-[2-(benzotriazol-1-yl)acetyl]anilino)-N-cyclopentyl-2-(3,4-dihydroxyphenyl)acetamide::2-[(4-acetamidophenyl)-[2-(benzotriazol-1-yl)ethanoyl]amino]-2-[3,4-bis(oxidanyl)phenyl]-N-cyclopentyl-ethanamide::MLS000703340::SMR000273804::cid_3178307
SMILES CC(=O)Nc1ccc(cc1)N(C(C(=O)NC1CCCC1)c1ccc(O)c(O)c1)C(=O)Cn1nnc2ccccc12
InChI Key InChIKey=MHKOWROBOVEKIU-UHFFFAOYSA-N
Data  1 IC50
  Tab Delimited (TSV)   2D SDfile   Computed 3D by Vconf -m prep SDfile
Find this compound or compounds like it in BindingDB:
Activity Spreadsheet -- Enzyme Inhibition Constant Data from BindingDB
Found 1 hit for monomerid = 47860
Target3C-like protease(Avian infectious bronchitis virus)
The Scripps Research Institute Molecular Screening Center
Curated by PubChem BioAssay
LigandPNGBDBM47860(2-(4-acetamido-N-[2-(1-benzotriazolyl)-1-oxoethyl]...)
Affinity DataIC50:  1.41E+4nM. Assay description: Source (MLPCN Center Name): The Scripps Research Institute Molecular Screening Center (SRIMSC) Center Affiliation: The Scripps Research Institute (TS...
In DepthDetails PCBioAssay