BDBM49260 4-[5-(4-methoxyphenyl)-1,3,4-oxadiazol-2-yl]aniline::MLS000058812::SMR000069078::[4-[5-(4-methoxyphenyl)-1,3,4-oxadiazol-2-yl]phenyl]amine::cid_1380741
SMILES COc1ccc(cc1)-c1nnc(o1)-c1ccc(N)cc1
InChI Key InChIKey=DDDUQQYRWNLBCN-UHFFFAOYSA-N
Data  1 EC50
  Tab Delimited (TSV)   2D SDfile   Computed 3D by Vconf -m prep SDfile
Find this compound or compounds like it in BindingDB:
Activity Spreadsheet -- Enzyme Inhibition Constant Data from BindingDB
Found 1 hit for monomerid = 49260
TargetTranscription factor p65(Homo sapiens (Human))
Srmlsc
Curated by PubChem BioAssay
LigandPNGBDBM49260(4-[5-(4-methoxyphenyl)-1,3,4-oxadiazol-2-yl]anilin...)
Affinity DataEC50:  2.12E+3nM. Assay description: Southern Research Molecular Libraries Screening Center (SRMLSC) Southern Research Institute (Birmingham, Alabama) NIH Molecular Libraries Screening C...
In DepthDetails PCBioAssay