BDBM50002775 5-(2-Benzenesulfonylamino-ethylsulfanyl)-10,11-dihydro-5H-dibenzo[a,d]cycloheptene-3-carboxylic acid::CHEMBL114588
SMILES OC(=O)c1ccc2CCc3ccccc3C(SCCNS(=O)(=O)c3ccccc3)c2c1
InChI Key InChIKey=QSQLLPCHAUUEJG-UHFFFAOYSA-N
Data  2 KI
  Tab Delimited (TSV)   2D SDfile   Computed 3D by Vconf -m prep SDfile
Find this compound or compounds like it in BindingDB:
Activity Spreadsheet -- Enzyme Inhibition Constant Data from BindingDB
Found 2 hits for monomerid = 50002775
TargetThromboxane A2 receptor(Homo sapiens (Human))
Kyowa Hakko Kogyo
Curated by ChEMBL
LigandPNGBDBM50002775(5-(2-Benzenesulfonylamino-ethylsulfanyl)-10,11-dih...)
Affinity DataKi:  30nM. Assay description: Inhibition of the thromboxane A2 receptor assayed by binding to guinea pig platelets using [3H]-U-46,619 as radioligand
In DepthDetails ArticlePubMed
TargetThromboxane A2 receptor(Homo sapiens (Human))
Kyowa Hakko Kogyo
Curated by ChEMBL
LigandPNGBDBM50002775(5-(2-Benzenesulfonylamino-ethylsulfanyl)-10,11-dih...)
Affinity DataKi:  30nM. Assay description: Inhibition of the thromboxane A2 receptor assayed by binding to guinea pig platelets using [3H]-U-46,619 as radioligand
In DepthDetails ArticlePubMed