BDBM50004691 CHEMBL2230095
SMILES CNC(=O)Oc1cccc(OCCCCOc2ccc(cc2)[N+]([O-])=O)c1
InChI Key InChIKey=WDNHKZOQGLRCKP-UHFFFAOYSA-N
Data  1 IC50
  Tab Delimited (TSV)   2D SDfile   Computed 3D by Vconf -m prep SDfile
Find this compound or compounds like it in BindingDB:
Activity Spreadsheet -- Enzyme Inhibition Constant Data from BindingDB
Found 1 hit for monomerid = 50004691
TargetCarboxylic ester hydrolase(Musca domestica)
Chinese Academy Of Agricultural Sciences
Curated by ChEMBL
LigandPNGBDBM50004691(CHEMBL2230095)
Affinity DataIC50:  4.60E+4nM. Assay description: Dual-site binding inhibition of AChE in Musca domestica (house fly) brain
In DepthDetails ArticlePubMed