BDBM50005393 8-Bicyclo[2.2.1]hept-5-en-2-yl-1,3-dipropyl-3,7-dihydro-purine-2,6-dione::CHEMBL438025
SMILES CCCn1c2nc([nH]c2c(=O)n(CCC)c1=O)[C@@H]1CC2CC1C=C2
InChI Key InChIKey=LMZOGRHOEMOQIR-WXRRBKDZSA-N
Data  2 KI
  Tab Delimited (TSV)   2D SDfile   Computed 3D by Vconf -m prep SDfile
Find this compound or compounds like it in BindingDB:
Activity Spreadsheet -- Enzyme Inhibition Constant Data from BindingDB
Found 2 hits for monomerid = 50005393
TargetAdenosine receptor A1(GUINEA PIG)
Kyowa Hakko Kogyo
Curated by ChEMBL
LigandPNGBDBM50005393(8-Bicyclo[2.2.1]hept-5-en-2-yl-1,3-dipropyl-3,7-di...)
Affinity DataKi:  4.30nM. Assay description: Binding affinity against adenosine A1 receptor using N6-[3H]cyclohexyladenosine as radioligand in guinea pig forebrain membranes
In DepthDetails ArticlePubMed
TargetAdenosine receptor A2a/A2b(Rattus norvegicus)
Kyowa Hakko Kogyo
Curated by ChEMBL
LigandPNGBDBM50005393(8-Bicyclo[2.2.1]hept-5-en-2-yl-1,3-dipropyl-3,7-di...)
Affinity DataKi:  480nM. Assay description: Binding affinity against adenosine A2 receptor using N-[3H]-ethyladenosin-5''-uronamide as radioligand in rat striatal membranes.
In DepthDetails ArticlePubMed