BDBM50005986 3-(2,2-Dimethyl-dodecanoylamino)-4-methoxy-benzoic acid methyl ester::CHEMBL40985
SMILES CCCCCCCCCCC(C)(C)C(=O)Nc1cc(ccc1OC)C(=O)OC
InChI Key InChIKey=LDIKKAWQXFKCRX-UHFFFAOYSA-N
Data  1 IC50
  Tab Delimited (TSV)   2D SDfile   Computed 3D by Vconf -m prep SDfile
Find this compound or compounds like it in BindingDB:
Activity Spreadsheet -- Enzyme Inhibition Constant Data from BindingDB
Found 1 hit for monomerid = 50005986
TargetAcyl-CoA:cholesterol acyltransferase(Oryctolagus cuniculus)
Warner-Lambert
Curated by ChEMBL
LigandPNGBDBM50005986(3-(2,2-Dimethyl-dodecanoylamino)-4-methoxy-benzoic...)
Affinity DataIC50:  130nM. Assay description: In vitro inhibition of acyl coenzyme A:cholesterol acyltransferase, in intestinal microsomes isolated from cholesterol-fed rabbits
In DepthDetails ArticlePubMed