BDBM50006290 6-Carboxymethyl-12-(3-guanidino-propyl)-15-isopropyl-5,8,11,14,17-pentaoxo-1-thia-4,7,10,13,16-pentaaza-cyclooctadecane-3-carboxylic acid::CHEMBL59693
SMILES CC(C)[C@H]1NC(=O)CSC[C@H](NC(=O)[C@H](CC(O)=O)NC(=O)CNC(=O)[C@H](CCCNC(N)=N)NC1=O)C(O)=O
InChI Key InChIKey=ZWFZEAWYCOFELN-NEULZYRMSA-N
Data  2 IC50
  Tab Delimited (TSV)   2D SDfile   Computed 3D by Vconf -m prep SDfile
Find this compound or compounds like it in BindingDB:
Activity Spreadsheet -- Enzyme Inhibition Constant Data from BindingDB
Found 2 hits for monomerid = 50006290
TargetIntegrin alpha-IIb/beta-3(Homo sapiens (Human))
Genentech
Curated by ChEMBL
LigandPNGBDBM50006290(6-Carboxymethyl-12-(3-guanidino-propyl)-15-isoprop...)
Affinity DataIC50:  17nM. Assay description: The compound was tested for the inhibition of fibrinogen receptor
In DepthDetails ArticlePubMed
TargetIntegrin alpha-IIb/beta-3(Homo sapiens (Human))
Genentech
Curated by ChEMBL
LigandPNGBDBM50006290(6-Carboxymethyl-12-(3-guanidino-propyl)-15-isoprop...)
Affinity DataIC50:  8.74E+3nM. Assay description: The compound was tested for the inhibition of fibrinogen receptor
In DepthDetails ArticlePubMed