BDBM50006841 2-[2-(1H-Indol-3-yl)-1-methyl-ethyl]-3-(3-isopropoxy-phenyl)-3H-quinazolin-4-one::CHEMBL85393
SMILES CC(C)Oc1cccc(c1)-n1c(nc2ccccc2c1=O)C(C)Cc1c[nH]c2ccccc12
InChI Key InChIKey=WVXCNBCXGRBJPK-UHFFFAOYSA-N
Data  1 IC50
  Tab Delimited (TSV)   2D SDfile   Computed 3D by Vconf -m prep SDfile
Find this compound or compounds like it in BindingDB:
Activity Spreadsheet -- Enzyme Inhibition Constant Data from BindingDB
Found 1 hit for monomerid = 50006841
TargetGastrin/cholecystokinin type B receptor(MOUSE)
Eli Lilly
Curated by ChEMBL
LigandPNGBDBM50006841(2-[2-(1H-Indol-3-yl)-1-methyl-ethyl]-3-(3-isopropo...)
Affinity DataIC50:  9.10E+3nM. Assay description: Evaluated for inhibition of [125I]-CCK-8S binding to cholecystokinin CCK-B receptor from mouse brain membranes at a concentration of 10 microM (in vi...
In DepthDetails ArticlePubMed