BDBM50011717 CHEMBL3262876
SMILES O=C(COc1ccc2ccccc2c1)N1CCN(CC1)C(=O)Cc1ccccc1
InChI Key InChIKey=BPTCJGVNSUEYAM-UHFFFAOYSA-N
Data  5 IC50
  Tab Delimited (TSV)   2D SDfile   Computed 3D by Vconf -m prep SDfile
Find this compound or compounds like it in BindingDB:
Activity Spreadsheet -- Enzyme Inhibition Constant Data from BindingDB
Found 5 hits for monomerid = 50011717
TargetG-protein coupled receptor 183(Homo sapiens (Human))
Novartis Institutes For Biomedical Research
Curated by ChEMBL
LigandPNGBDBM50011717(CHEMBL3262876)
Affinity DataIC50:  196nM. Assay description: Antagonist activity at recombinant human EBI2 receptor expressed in CHO cells assessed as inhibition of NIBR51-induced intracellular calcium release ...
In DepthDetails ArticlePubMed
TargetG-protein coupled receptor 183(Homo sapiens (Human))
Novartis Institutes For Biomedical Research
Curated by ChEMBL
LigandPNGBDBM50011717(CHEMBL3262876)
Affinity DataIC50:  83nM. Assay description: Displacement of [3H]-7-alpha,25-OHC from recombinant human EBI2 receptor expressed in CHO cells after 10 mins by scintillation counting analysis
In DepthDetails ArticlePubMed
TargetG-protein coupled receptor 183(Mus musculus)
Novartis Institutes For Biomedical Research
Curated by ChEMBL
LigandPNGBDBM50011717(CHEMBL3262876)
Affinity DataIC50:  423nM. Assay description: Antagonist activity at recombinant mouse EBI2 receptor expressed in CHO cells assessed as inhibition of NIBR51-induced intracellular calcium release ...
In DepthDetails ArticlePubMed
TargetG-protein coupled receptor 183(Homo sapiens (Human))
Novartis Institutes For Biomedical Research
Curated by ChEMBL
LigandPNGBDBM50011717(CHEMBL3262876)
Affinity DataIC50:  5.30nM. Assay description: Antagonist activity at EBI2 receptor in human U937 cells assessed as inhibition of 7-alpha,25-OHC-induced cell migration after 3 hrs by flow cytometr...
In DepthDetails ArticlePubMed
TargetG-protein coupled receptor 183(Homo sapiens (Human))
Novartis Institutes For Biomedical Research
Curated by ChEMBL
LigandPNGBDBM50011717(CHEMBL3262876)
Affinity DataIC50:  91nM. Assay description: Antagonist activity at EBI2 receptor in human U937 cells assessed as inhibition of oxysterol-induced calcium release measured for 3 mins by FLIPR ass...
In DepthDetails ArticlePubMed