BDBM50012110 CHEMBL3263674
SMILES FC(F)(F)c1ccccc1N1CCN(CC1)c1ccc(cc1NC(=O)c1coc(n1)C1CC1)C(=O)NCCCN1CCCC1=O
InChI Key InChIKey=WYLZHPLJOPBGFH-UHFFFAOYSA-N
Data  1 EC50
  Tab Delimited (TSV)   2D SDfile   Computed 3D by Vconf -m prep SDfile
Find this compound or compounds like it in BindingDB:
Activity Spreadsheet -- Enzyme Inhibition Constant Data from BindingDB
Found 1 hit for monomerid = 50012110
TargetFollicle-stimulating hormone receptor(Homo sapiens (Human))
Emd-Serono Research Institute
Curated by ChEMBL
LigandPNGBDBM50012110(CHEMBL3263674)
Affinity DataEC50:  1.00E+6nM. Assay description: Positive allosteric modulation of human FSH receptor expressed in CHO cells assessed as effect on FSH-induced cAMP accumulation after 1 hr by HTRF as...
In DepthDetails ArticlePubMed