BDBM50013681 CHEMBL3264516
SMILES CCOC(=O)c1c(C)oc2ccc(Oc3ccc(C)cc3)cc12
InChI Key InChIKey=CUHTUSNYDQACPN-UHFFFAOYSA-N
Data  2 IC50
  Tab Delimited (TSV)   2D SDfile   Computed 3D by Vconf -m prep SDfile
Find this compound or compounds like it in BindingDB:
Activity Spreadsheet -- Enzyme Inhibition Constant Data from BindingDB
Found 2 hits for monomerid = 50013681
TargetProstaglandin G/H synthase 2(Homo sapiens (Human))
Banaras Hindu University
Curated by ChEMBL
LigandPNGBDBM50013681(CHEMBL3264516)
Affinity DataIC50:  4.20E+3nM. Assay description: Inhibition of human recombinant COX-2 expressed in insect cell system using arachidonic acid as substrate assessed as reduction of PGG2 to PGH2 incub...
In DepthDetails ArticlePubMed
TargetProstaglandin G/H synthase 1(RAT)
Banaras Hindu University
Curated by ChEMBL
LigandPNGBDBM50013681(CHEMBL3264516)
Affinity DataIC50:  4.97E+4nM. Assay description: Inhibition of rat seminal vesicle COX-1 using arachidonic acid as substrate assessed as reduction of PGG2 to PGH2 incubated for 1 min prior to substr...
In DepthDetails ArticlePubMed