BDBM50017941 CHEMBL3289020
SMILES NC(=N)c1ccc(Oc2cc(Oc3ccc(cc3)C(N)=N)cc(c2)C(=O)NC2CCC(O)CC2)cc1
InChI Key InChIKey=WVZPTQBJMNONAV-UHFFFAOYSA-N
Data  3 KI
  Tab Delimited (TSV)   2D SDfile   Computed 3D by Vconf -m prep SDfile
Find this compound or compounds like it in BindingDB:
Activity Spreadsheet -- Enzyme Inhibition Constant Data from BindingDB
Found 3 hits for monomerid = 50017941
TargetSuppressor of tumorigenicity 14 protein(Homo sapiens (Human))
Aurigene Discovery Technologies
Curated by ChEMBL
LigandPNGBDBM50017941(CHEMBL3289020)
Affinity DataKi:  301nM. Assay description: Inhibition of recombinant matriptase (unknown origin) using Boc-Gln-Ala-Arg-7-amido-4-methyl coumarin hydrobromide
In DepthDetails ArticlePubMed
TargetCoagulation factor X(Bos taurus)
Aurigene Discovery Technologies
Curated by ChEMBL
LigandPNGBDBM50017941(CHEMBL3289020)
Affinity DataKi:  538nM. Assay description: Inhibition of bovine plasma factor 10a using CH3OCO-D-CHA-Gly-Arg-pNA.AcoH substrate
In DepthDetails ArticlePubMed
TargetProthrombin(Homo sapiens (Human))
Aurigene Discovery Technologies
Curated by ChEMBL
LigandPNGBDBM50017941(CHEMBL3289020)
Affinity DataKi:  1.24E+3nM. Assay description: Inhibition of human thrombin using Boc-Gln-Ala-Arg-7-amido-4-methyl coumarin hydrobromide
In DepthDetails ArticlePubMed