BDBM50029249 CHEMBL542483::{5-[4-(2-Isopropoxy-phenyl)-piperazin-1-ylmethyl]-thiophen-3-yl}-piperidin-1-yl-methanone; hydrochloride
SMILES CC(C)Oc1ccccc1N1CCN(Cc2cc(cs2)C(=O)N2CCCCC2)CC1
InChI Key InChIKey=IDMGFFRFALKXDG-UHFFFAOYSA-N
Data  2 KI
  Tab Delimited (TSV)   2D SDfile   Computed 3D by Vconf -m prep SDfile
Find this compound or compounds like it in BindingDB:
Activity Spreadsheet -- Enzyme Inhibition Constant Data from BindingDB
Found 2 hits for monomerid = 50029249
Target5-hydroxytryptamine receptor 1A(Rattus norvegicus (rat))
R. W. Johnson Pharmaceutical Research Institute
Curated by ChEMBL
LigandPNGBDBM50029249(CHEMBL542483 | {5-[4-(2-Isopropoxy-phenyl)-piperaz...)
Affinity DataKi:  2.5nM. Assay description: Binding affinity was determined against 5-hydroxytryptamine 1A receptor using [3H]WB-4101
In DepthDetails ArticlePubMed
TargetD(2) dopamine receptor(Rattus norvegicus (rat))
R. W. Johnson Pharmaceutical Research Institute
Curated by ChEMBL
LigandPNGBDBM50029249(CHEMBL542483 | {5-[4-(2-Isopropoxy-phenyl)-piperaz...)
Affinity DataKi:  24nM. Assay description: Binding affinity was determined against Dopamine receptor D2 using [3H]spiperone
In DepthDetails ArticlePubMed