BDBM50033769 4-Ethyl-4-hydroxy-7-[2-oxo-1,2-dihydro-indol-(3E)-ylidene]-1,4,7,8-tetrahydro-pyrano[3,4-f]indolizine-3,6,10-trione::CHEMBL170599
SMILES CCC1(O)C(=O)OCc2c1cc1C(=O)\C(Cn1c2=O)=C1\C(=O)Nc2ccccc12
InChI Key InChIKey=NMDGEPVFVYVILO-LFIBNONCSA-N
Data  1 IC50
  Tab Delimited (TSV)   2D SDfile   Computed 3D by Vconf -m prep SDfile
Find this compound or compounds like it in BindingDB:
Activity Spreadsheet -- Enzyme Inhibition Constant Data from BindingDB
Found 1 hit for monomerid = 50033769
TargetDNA topoisomerase 1(Homo sapiens (Human))
Glaxo Research Institute
Curated by ChEMBL
LigandPNGBDBM50033769(4-Ethyl-4-hydroxy-7-[2-oxo-1,2-dihydro-indol-(3E)-...)
Affinity DataIC50:  5.80E+3nM. Assay description: Inhibition of bovine topoisomerase I, using cleavable complex assay.
In DepthDetails ArticlePubMed