BDBM50035669 CHEMBL3338457
SMILES NNC(=O)CC(=O)Nc1ccccc1[N+]([O-])=O
InChI Key InChIKey=FKXQZMHDYHWJOP-UHFFFAOYSA-N
Data  1 KI
  Tab Delimited (TSV)   2D SDfile   Computed 3D by Vconf -m prep SDfile
Find this compound or compounds like it in BindingDB:
Activity Spreadsheet -- Enzyme Inhibition Constant Data from BindingDB
Found 1 hit for monomerid = 50035669
TargetSerine/threonine-protein kinase PknB(Mycobacterium tuberculosis)
Csir-Central Drug Research Institute
Curated by ChEMBL
LigandPNGBDBM50035669(CHEMBL3338457)
Affinity DataKi:  2.29E+4nM. Assay description: Inhibition of Mycobacterium tuberculosis PknB
In DepthDetails ArticlePubMed