BDBM50036219 (2S,3R)-3-Carboxy-3-hydroxy-2-mercapto-pentanedioic acid::CHEMBL120532
SMILES OC(=O)C[C@](O)([C@H](S)C(O)=O)C(O)=O
InChI Key InChIKey=SVKLQJXHCIOPPE-CVYQJGLWSA-N
Data  2 KI
  Tab Delimited (TSV)   2D SDfile   Computed 3D by Vconf -m prep SDfile
Find this compound or compounds like it in BindingDB:
Activity Spreadsheet -- Enzyme Inhibition Constant Data from BindingDB
Found 2 hits for monomerid = 50036219
TargetATP-citrate synthase(Rattus norvegicus)
Smithkline Beecham Pharmaceuticals
Curated by ChEMBL
LigandPNGBDBM50036219((2S,3R)-3-Carboxy-3-hydroxy-2-mercapto-pentanedioi...)
Affinity DataKi:  5.80E+4nM. Assay description: Inhibitory activity was tested agianst ATP-Citrate Lyase (ACL) enzyme in rat
In DepthDetails ArticlePubMed
TargetATP-citrate synthase(Rattus norvegicus)
Smithkline Beecham Pharmaceuticals
Curated by ChEMBL
LigandPNGBDBM50036219((2S,3R)-3-Carboxy-3-hydroxy-2-mercapto-pentanedioi...)
Affinity DataKi:  5.80E+4nM. Assay description: Reversible binding potential for rat ATP-Citrate Lyase as carbon-carbon bond cleavage activity in citrate substrate
In DepthDetails ArticlePubMed