BDBM50037875 CBS-4::CHEMBL341330
SMILES CSCCC(NC(=O)C(Cc1c[nH]c2ccccc12)NC(=O)CCC(=O)N(Cc1ccccc1)N=NCCCl)C(=O)NC(CC(O)=O)C(=O)NC(Cc1ccccc1)C(N)=O
InChI Key InChIKey=XWQRRMUYEAUPRO-UHFFFAOYSA-N
Data  1 EC50
  Tab Delimited (TSV)   2D SDfile   Computed 3D by Vconf -m prep SDfile
Find this compound or compounds like it in BindingDB:
Activity Spreadsheet -- Enzyme Inhibition Constant Data from BindingDB
Found 1 hit for monomerid = 50037875
TargetGastrin/cholecystokinin type B receptor(Homo sapiens (Human))
National Cancer Institute-Frederick
Curated by ChEMBL
LigandPNGBDBM50037875(CBS-4 | CHEMBL341330)
Affinity DataEC50:  130nM. Assay description: Tested for the 50% inhibition level against [125I]- gastrin binding to guinea pig gastric glands
In DepthDetails ArticlePubMed