BDBM50039441 CHEMBL78581::Carbamic acid bis(2,6-dimethyl-phenyl ester)
SMILES Cc1cccc(C)c1OC(=O)NC(=O)Oc1c(C)cccc1C
InChI Key InChIKey=RNEMMTVVROPKQJ-UHFFFAOYSA-N
Data  1 IC50
  Tab Delimited (TSV)   2D SDfile   Computed 3D by Vconf -m prep SDfile
Find this compound or compounds like it in BindingDB:
Activity Spreadsheet -- Enzyme Inhibition Constant Data from BindingDB
Found 1 hit for monomerid = 50039441
TargetAcyl-CoA:cholesterol acyltransferase(Oryctolagus cuniculus)
Warner-Lambert
Curated by ChEMBL
LigandPNGBDBM50039441(CHEMBL78581 | Carbamic acid bis(2,6-dimethyl-pheny...)
Affinity DataIC50: >5.00E+3nM. Assay description: In vitro Acyl coenzyme A:cholesterol acyltransferase inhibitory activity (IAI) was determined by measuring the incorporation of [1-14C]oleolyl-CoA in...
In DepthDetails ArticlePubMed