BDBM50041250 CHEMBL283775::Phenethyl-(3-phenyl-propyl)-amine
SMILES C(CNCCc1ccccc1)Cc1ccccc1
InChI Key InChIKey=MCXHGJLRTJKZGT-UHFFFAOYSA-N
Data  1 KI  3 IC50
  Tab Delimited (TSV)   2D SDfile   Computed 3D by Vconf -m prep SDfile
Find this compound or compounds like it in BindingDB:
Activity Spreadsheet -- Enzyme Inhibition Constant Data from BindingDB
Found 4 hits for monomerid = 50041250
TargetSigma non-opioid intracellular receptor 1(Homo sapiens (Human))
Virginia Commonwealth University
Curated by ChEMBL
LigandPNGBDBM50041250(CHEMBL283775 | Phenethyl-(3-phenyl-propyl)-amine)
Affinity DataKi:  11.3nM. Assay description: Binding affinity against sigma-1 receptor of guinea pig brain membranes using [3H]-pentazocine as radioligand
In DepthDetails ArticlePubMed
TargetGlutamate receptor ionotropic, NMDA 1/2C(RAT)
University Of Oregon
Curated by ChEMBL
LigandPNGBDBM50041250(CHEMBL283775 | Phenethyl-(3-phenyl-propyl)-amine)
Affinity DataIC50: >1.00E+5nM. Assay description: Functional antagonism by electrical assays in Xenopus oocytes expressing the 1A/2C NMDA receptor
In DepthDetails ArticlePubMed
TargetGlutamate receptor ionotropic, NMDA 1/2B(Rattus norvegicus (Rat))
University Of Oregon
Curated by ChEMBL
LigandPNGBDBM50041250(CHEMBL283775 | Phenethyl-(3-phenyl-propyl)-amine)
Affinity DataIC50:  7.30E+3nM. Assay description: Functional antagonism by electrical assays in Xenopus oocytes expressing the 1A/2B NMDA receptor
In DepthDetails ArticlePubMed
TargetGlutamate receptor ionotropic, NMDA 1/2A(Rattus norvegicus (Rat))
University Of Oregon
Curated by ChEMBL
LigandPNGBDBM50041250(CHEMBL283775 | Phenethyl-(3-phenyl-propyl)-amine)
Affinity DataIC50: >1.00E+5nM. Assay description: Functional antagonism by electrical assays in Xenopus oocytes expressing 1A/2A NMDA receptor subtype
In DepthDetails ArticlePubMed