BDBM50050500 CHEMBL3085443::Sodium; 3,5-dihydroxy-2-[5-hydroxy-2-hydroxymethyl-6-(2-tetradecyl-hexadecyloxy)-4-(3,4,5-trihydroxy-6-methyl-tetrahydro-pyran-2-yloxy)-tetrahydro-pyran-3-yloxy]-6-hydroxymethyl-tetrahydro-pyran-4-sulfonate
SMILES [Na+].CCCCCCCCCCCCCCC(CCCCCCCCCCCCCC)CO[C@@H]1O[C@@H](CO)[C@@H](O[C@@H]2O[C@@H](CO)[C@H](O)[C@@H]([C@@H]2O)S([O-])(=O)=O)[C@H](O[C@H]2O[C@@H](C)[C@@H](O)[C@H](O)[C@@H]2O)[C@@H]1O
InChI Key InChIKey=ZHHWZHXFCBJLLJ-ZIAFEUFESA-M
Data  3 IC50
  Tab Delimited (TSV)   2D SDfile   Computed 3D by Vconf -m prep SDfile
Find this compound or compounds like it in BindingDB:
Activity Spreadsheet -- Enzyme Inhibition Constant Data from BindingDB
Found 3 hits for monomerid = 50050500
TargetP-selectin(Homo sapiens (Human))
New Drug Research Laboratory
Curated by ChEMBL
LigandPNGBDBM50050500(CHEMBL3085443 | Sodium; 3,5-dihydroxy-2-[5-hydroxy...)
Affinity DataIC50:  3.00E+4nM. Assay description: Inhibitory concentration against blocking of Selectin P during migration of inflammatory cells to inflammatory site
In DepthDetails ArticlePubMed
TargetL-selectin(Homo sapiens (Human))
New Drug Research Laboratory
Curated by ChEMBL
LigandPNGBDBM50050500(CHEMBL3085443 | Sodium; 3,5-dihydroxy-2-[5-hydroxy...)
Affinity DataIC50:  3.00E+4nM. Assay description: Inhibitory concentration against blocking of Selectin L during migration of inflammatory cells to inflammatory site
In DepthDetails ArticlePubMed
TargetE-selectin(Homo sapiens (Human))
New Drug Research Laboratory
Curated by ChEMBL
LigandPNGBDBM50050500(CHEMBL3085443 | Sodium; 3,5-dihydroxy-2-[5-hydroxy...)
Affinity DataIC50:  3.00E+4nM. Assay description: Inhibitory concentration against blocking of E-selectin during migration of inflammatory cells to inflammatory site
In DepthDetails ArticlePubMed