BDBM50051486 ((1R,2S)-2-Naphthalen-2-yl-cyclopropyl)-[(S)-3-(pyrrolidine-1-carbonyl)-2-aza-bicyclo[2.2.2]oct-2-yl]-methanone::CHEMBL76754
SMILES O=C([C@@H]1C[C@@H]1c1ccc2ccccc2c1)N1C2CCC(CC2)[C@H]1C(=O)N1CCCC1
InChI Key InChIKey=DPNNDWVBKHGQMD-OLJVYXQXSA-N
Data  1 IC50
  Tab Delimited (TSV)   2D SDfile   Computed 3D by Vconf -m prep SDfile
Find this compound or compounds like it in BindingDB:
Activity Spreadsheet -- Enzyme Inhibition Constant Data from BindingDB
Found 1 hit for monomerid = 50051486
TargetProlyl endopeptidase(Rattus norvegicus)
Institut De Recherche Servier
Curated by ChEMBL
LigandPNGBDBM50051486(((1R,2S)-2-Naphthalen-2-yl-cyclopropyl)-[(S)-3-(py...)
Affinity DataIC50:  5nM. Assay description: Inhibitory activity of the compound was evaluated against Post-proline cleaving enzyme from rat cortex
In DepthDetails ArticlePubMed