BDBM50051520 CHEMBL305681::[(2S,3aS,7aS)-2-(Pyrrolidine-1-carbonyl)-octahydro-indol-1-yl]-[(1R,2S)-2-(3-trifluoromethyl-phenyl)-cyclopropyl]-methanone
SMILES FC(F)(F)c1cccc(c1)[C@H]1C[C@H]1C(=O)N1[C@H]2CCCC[C@H]2C[C@H]1C(=O)N1CCCC1
InChI Key InChIKey=VLIWPGHSXRUDNJ-MYGYKHERSA-N
Data  1 IC50
  Tab Delimited (TSV)   2D SDfile   Computed 3D by Vconf -m prep SDfile
Find this compound or compounds like it in BindingDB:
Activity Spreadsheet -- Enzyme Inhibition Constant Data from BindingDB
Found 1 hit for monomerid = 50051520
TargetProlyl endopeptidase(Rattus norvegicus)
Institut De Recherche Servier
Curated by ChEMBL
LigandPNGBDBM50051520(CHEMBL305681 | [(2S,3aS,7aS)-2-(Pyrrolidine-1-carb...)
Affinity DataIC50:  0.900nM. Assay description: Inhibitory activity of the compound was evaluated against Post-proline cleaving enzyme from rat cortex
In DepthDetails ArticlePubMed