BDBM50053417 CHEMBL3318851
SMILES Fc1ccc(cc1)C(=O)CCCN1CCC(CC1)(OC(=O)CCc1cn(CCOCCOCCOCCOCCn2cc(CCC(=O)OC3(CCN(CCCC(=O)c4ccc(F)cc4)CC3)c3ccc(Cl)cc3)nn2)nn1)c1ccc(Cl)cc1
InChI Key InChIKey=VCSXUTPJFQYQHZ-UHFFFAOYSA-N
Data  5 KI
  Tab Delimited (TSV)   2D SDfile   Computed 3D by Vconf -m prep SDfile
Find this compound or compounds like it in BindingDB:
Activity Spreadsheet -- Enzyme Inhibition Constant Data from BindingDB
Found 5 hits for monomerid = 50053417
TargetD(2) dopamine receptor(Homo sapiens (Human))
Friedrich-Alexander University
Curated by ChEMBL
LigandPNGBDBM50053417(CHEMBL3318851)
Affinity DataKi:  1.60nM. Assay description: Displacement of [3H]spiperone from human D2long receptor stably expressed in CHO cell membranes by competitive binding assay
In DepthDetails ArticlePubMed
TargetD(2) dopamine receptor(Homo sapiens (Human))
Friedrich-Alexander University
Curated by ChEMBL
LigandPNGBDBM50053417(CHEMBL3318851)
Affinity DataKi:  3.80nM. Assay description: Displacement of [3H]spiperone from human D2short receptor stably expressed in CHO cell membranes by competitive binding assay
In DepthDetails ArticlePubMed
TargetD(3) dopamine receptor(Homo sapiens (Human))
Friedrich-Alexander University
Curated by ChEMBL
LigandPNGBDBM50053417(CHEMBL3318851)
Affinity DataKi:  19nM. Assay description: Displacement of [3H]spiperone from human D3 receptor stably expressed in CHO cell membranes by competitive binding assay
In DepthDetails ArticlePubMed
TargetD(4) dopamine receptor(Homo sapiens (Human))
Friedrich-Alexander University
Curated by ChEMBL
LigandPNGBDBM50053417(CHEMBL3318851)
Affinity DataKi:  46nM. Assay description: Displacement of [3H]spiperone from human D4.4 receptor stably expressed in CHO cell membranes by competitive binding assay
In DepthDetails ArticlePubMed
TargetD(1A) dopamine receptor(Sus scrofa)
Friedrich-Alexander University
Curated by ChEMBL
LigandPNGBDBM50053417(CHEMBL3318851)
Affinity DataKi:  150nM. Assay description: Displacement of [3H]SCH23390 from porcine striatal membranes D1 receptor by competitive binding assay
In DepthDetails ArticlePubMed