BDBM50054568 (Z)-2-Cyano-3-cyclopropyl-N-(4-furan-2-yl-phenyl)-3-hydroxy-acrylamide::CHEMBL139611
SMILES O=C(Nc1ccc(cc1)-c1ccco1)C(C#N)C(=O)C1CC1
InChI Key InChIKey=MDFZKERGJWPYSZ-UHFFFAOYSA-N
Data  2 IC50
  Tab Delimited (TSV)   2D SDfile   Computed 3D by Vconf -m prep SDfile
Find this compound or compounds like it in BindingDB:
Activity Spreadsheet -- Enzyme Inhibition Constant Data from BindingDB
Found 2 hits for monomerid = 50054568
TargetDihydroorotate dehydrogenase (quinone), mitochondrial(Rattus norvegicus (rat))
Hoechst Marion Roussel
Curated by ChEMBL
LigandPNGBDBM50054568((Z)-2-Cyano-3-cyclopropyl-N-(4-furan-2-yl-phenyl)-...)
Affinity DataIC50:  1.78E+3nM. Assay description: Inhibitory concentration tested against enzyme dihydroorotate dehydrogenase in rat
In DepthDetails ArticlePubMed
TargetDihydroorotate dehydrogenase (quinone), mitochondrial(Mus musculus)
Hoechst Marion Roussel
Curated by ChEMBL
LigandPNGBDBM50054568((Z)-2-Cyano-3-cyclopropyl-N-(4-furan-2-yl-phenyl)-...)
Affinity DataIC50:  5.90E+3nM. Assay description: Inhibitory concentration tested on enzyme dihydroorotate dehydrogenase in mouse
In DepthDetails ArticlePubMed