BDBM50054597 (Z)-2-Cyano-3-cyclopropyl-3-hydroxy-N-(5-trifluoromethyl-pyridin-2-yl)-acrylamide::CHEMBL140558
SMILES FC(F)(F)c1ccc(NC(=O)C(C#N)C(=O)C2CC2)nc1
InChI Key InChIKey=TUGYWXLKAAQFFM-UHFFFAOYSA-N
Data  2 IC50
  Tab Delimited (TSV)   2D SDfile   Computed 3D by Vconf -m prep SDfile
Find this compound or compounds like it in BindingDB:
Activity Spreadsheet -- Enzyme Inhibition Constant Data from BindingDB
Found 2 hits for monomerid = 50054597
TargetDihydroorotate dehydrogenase (quinone), mitochondrial(Mus musculus)
Hoechst Marion Roussel
Curated by ChEMBL
LigandPNGBDBM50054597((Z)-2-Cyano-3-cyclopropyl-3-hydroxy-N-(5-trifluoro...)
Affinity DataIC50:  158nM. Assay description: Inhibitory concentration tested on enzyme dihydroorotate dehydrogenase in mouse
In DepthDetails ArticlePubMed
TargetDihydroorotate dehydrogenase (quinone), mitochondrial(Rattus norvegicus (rat))
Hoechst Marion Roussel
Curated by ChEMBL
LigandPNGBDBM50054597((Z)-2-Cyano-3-cyclopropyl-3-hydroxy-N-(5-trifluoro...)
Affinity DataIC50:  17nM. Assay description: Inhibitory concentration tested against enzyme dihydroorotate dehydrogenase in rat
In DepthDetails ArticlePubMed