BDBM50056794 CHEMBL3331349
SMILES [H][C@@]12CC=C(c3cncc4ccccc34)[C@@]1(C)CC[C@]1([H])c3cc(OC)c(O)cc3CC[C@@]21[H]
InChI Key InChIKey=GAGPFOMCVBTNFU-DDDPIEGRSA-N
Data  1 IC50
  Tab Delimited (TSV)   2D SDfile   Computed 3D by Vconf -m prep SDfile
Find this compound or compounds like it in BindingDB:
Activity Spreadsheet -- Enzyme Inhibition Constant Data from BindingDB
Found 1 hit for monomerid = 50056794
TargetTubulin beta chain(Sus scrofa)
University Of Oslo
Curated by ChEMBL
LigandPNGBDBM50056794(CHEMBL3331349)
Affinity DataIC50:  4.80E+3nM. Assay description: Inhibition of porcine brain tubulin polymerization after 60 mins
In DepthDetails ArticlePubMed